上陸人員数
type: TerminologyConcept
description: 調査港湾へ入港した船舶からの上陸客数。調査対象外：（ア）同一港内を往来した船舶からの上陸客、（イ）当該船舶の船員及び従業員、（ウ）自動車航送船の上陸人員のうち、乗船券を購入しないトラック、バス、乗用車及びその他車両の乗員及び乗客。
created: 2017-12-01
broader: Ta00141
in scheme: TerminologyConceptScheme
top concept of: TerminologyConceptScheme

RDF description of 上陸人員数
primary topic: 上陸人員数