従業員賞与額_2
type: TerminologyConcept
description: 常用、臨時を問わず、従業員に対し当期間に計上した賞与（所得税・保険料等控除前、賞与引当金繰入額を含む）の総額。
created: 2017-12-01
broader: Ta00088
in scheme: TerminologyConceptScheme
top concept of: TerminologyConceptScheme

RDF description of 従業員賞与額_2
primary topic: 従業員賞与額_2