消費面積量
type: TerminologyConcept
description: 消費量を面積の単位（a、ha、m2、km2、sq.in.、平方デシメートル、畳、坪、畝歩など）で表したもの。消費とは、事業所及び工場で生産した製品並びに他からの受入品の、他の製品の原材料又は加工品用としての自家消費（自己消費）を指す。ただし、当該調査票が対象としている事業のために消費したものに限り、事業所が他の業務を兼業し、その業務を行うために消費したものは除く。また、自工場施設などへの設備投資、見本用、贈答用、展示用、試験研究用などの自家使用は含まない。
created: 2017-12-01
broader: Ta00226
in scheme: TerminologyConceptScheme
top concept of: TerminologyConceptScheme

RDF description of 消費面積量
primary topic: 消費面積量