消費税の取扱い
type: TerminologyConcept
top concept of: TerminologyConceptScheme
narrower: si457010028
description: 消費税の取扱い（調査票に記入した金額に関するもの）が税込みであるか税抜きであるかの別。
narrower: si409020029
narrower: si408020029
narrower: si456010008
in scheme: TerminologyConceptScheme
created: 2017-12-01
broader: Ta00566

RDF description of 消費税の取扱い
primary topic: 消費税の取扱い