RDF description of 消費見込量
primary topic: 消費見込量

消費見込量
type: TerminologyConcept
in scheme: TerminologyConceptScheme
top concept of: TerminologyConceptScheme
broader: Ta00237
created: 2017-12-01
description: 今後の消費見込量を体積の単位（l、kl、m3、Nm3など）で表したもの。消費とは、事業所及び工場で生産した製品並びに他からの受入品の、他の製品の原材料又は加工品用としての自家消費（自己消費）を指す。ただし、当該調査票が対象としている事業のために消費したものに限り、事業所が他の業務を兼業し、その業務を行うために消費したものは除く。また、自工場施設などへの設備投資、見本用、贈答用、展示用、試験研究用などの自家使用したものを含む。