RDF description of 小作地の生産調整実施面積
primary topic: 小作地の生産調整実施面積

小作地の生産調整実施面積
type: TerminologyConcept
description: 小作地の生産調整を実施した面積。小作地とは、所有権以外の権利(賃借権、使用貸借による権利等)に基づいて耕作される農地をいう。
created: 2017-12-01
broader: Ta00185
in scheme: TerminologyConceptScheme
top concept of: TerminologyConceptScheme