部の学級区分
type: TerminologyConcept
description: 特別支援学校の幼稚部・小学部・中学部・高等部の各部において、調査実施年度の５月１日現在同意を得（認可を受け）、又は届出をしている等、正規の手続きを完了している学級編制に基づく学級の名称。５月１日現在同意を得ていない（未認可である）が、５月１日付け、又はそれ以前の日にさかのぼって同意を得る（認可される）ことが確実な場合は記入される。災害等のために臨時に学級編制を行っている場合は、本来の学級編制による。
created: 2017-12-01
broader: Ta00516
top concept of: TerminologyConceptScheme
in scheme: TerminologyConceptScheme

RDF description of 部の学級区分
primary topic: 部の学級区分