商品販売額_2
type: TerminologyConcept
description: 販売業者又は消費者である他企業に直接販売したもの、販売することを目的として本社・営業所等に出荷したもののうち、有体商品の販売額。現金販売では代金のその全額。信用販売では商品を引き渡したときのその代金の全額。試用販売では購入の申し込みがあり、売買契約が成立したとき又は代金を入金したときの額。商品の受託販売の取扱額は含まない。諸経費を差し引く前の売上金額である。不動産、有価証券、卸売及びテナントの販売やサービス業務による収入は含めない。
created: 2017-12-01
broader: Ta00054
top concept of: TerminologyConceptScheme
in scheme: TerminologyConceptScheme

RDF description of 商品販売額_2
primary topic: 商品販売額_2