商品生産収入額_2
type: TerminologyConcept
description: 事業所において実際に生産した製品によって得られる額。受託製造の場合、委託者の受領をもって生産とする。価格は、生産者による販売価格又は契約価格による評価額。企業の販売価格から積込料、運賃、保険料及びその他の諸掛り（積下し料、倉庫料、港湾運送費、船積料）を差し引き、消費税を加えた額となる。
created: 2017-12-01
broader: Ta00052
top concept of: TerminologyConceptScheme
in scheme: TerminologyConceptScheme

RDF description of 商品生産収入額_2
primary topic: 商品生産収入額_2