RDF description of 商品生産収入額_1
primary topic: 商品生産収入額_1

商品生産収入額_1
type: TerminologyConcept
in scheme: TerminologyConceptScheme
top concept of: TerminologyConceptScheme
broader: Ta00052
created: 2017-12-01
description: 事業所において実際に生産した製品によって得られる額。製品とは、修理改造、再製品を除く最終の社内検査又は立ち会い検査を完了したものを指す。受入品（輸入品（自社他社を問わない。）を含む。）で検査のみを国内で行ったものなどは含めない。生産には自家使用又は自己消費する目的で生産したものを含む。受託生産は含むが、委託生産は含まない。価格は、生産者販売価格又は契約価格による評価額。企業の販売価格から積込料、運賃、保険料及びその他の諸掛り（積下し料、倉庫料、港湾運送費、船積料）を差し引き、消費税を加えた額である。包装又は梱包して収監する製品の包装費又は梱包費を含む。