RDF description of 商品生産・輸入額_2
primary topic: 商品生産・輸入額_2

商品生産・輸入額_2
type: TerminologyConcept
description: 輸入額又は生産額。輸入とは、製剤で輸入され国内で小分け製造されたもの、製剤で輸入されそのまま市場に出荷されたものを指す。包装・表示又は保管のみの委託を除く委託製造を含む。受託製造の場合、委託者の受領をもって生産とする。価格は、輸入者又は生産者による販売価格又は契約価格による評価額。企業の販売価格から積込料、運賃、保険料及びその他の諸掛り（積下し料、倉庫料、港湾運送費、船積料）を差し引き、消費税を加えた額となる。
created: 2017-12-01
broader: Ta00052
in scheme: TerminologyConceptScheme
top concept of: TerminologyConceptScheme