商品修理収入額
type: TerminologyConcept
description: 商品を販売するかたわら、販売商品に関連した修理を行った場合の修理料の額。商品販売に関連しない修理料は除く。
created: 2017-12-01
broader: Ta00069
top concept of: TerminologyConceptScheme
in scheme: TerminologyConceptScheme

RDF description of 商品修理収入額
primary topic: 商品修理収入額