商品国内卸売販売額
type: TerminologyConcept
description: 商社、生産業者などから商品を仕入れ、国内の小売業者や卸売業者に販売する額。自社製造品の国内販売を含む。
created: 2017-12-01
broader: Ta00054
top concept of: TerminologyConceptScheme
in scheme: TerminologyConceptScheme

RDF description of 商品国内卸売販売額
primary topic: 商品国内卸売販売額