RDF description of 商品卸売販売額_2
primary topic: 商品卸売販売額_2

商品卸売販売額_2
type: TerminologyConcept
in scheme: TerminologyConceptScheme
top concept of: TerminologyConceptScheme
broader: Ta00054
created: 2017-12-01
description: 卸売による販売額。卸売とは、本社が仕入れた商品を各支社・支店等に移動（帳簿上）し、他社又は消費者に販売すること、又は自社の他事業所が製造した製品を本支店間・支店相互間移動により仕入れて販売すること。