RDF description of 商業用需要家メーター調定数
primary topic: 商業用需要家メーター調定数

商業用需要家メーター調定数
type: TerminologyConcept
in scheme: TerminologyConceptScheme
top concept of: TerminologyConceptScheme
broader: Ta00419
created: 2017-12-01
description: 料理飲食店、旅館、会社、百貨店、銀行、劇場、娯楽場等の需要家に対して発行する請求書の枚数。