RDF description of 商業用需要家メーター取付数
primary topic: 商業用需要家メーター取付数

商業用需要家メーター取付数
type: TerminologyConcept
in scheme: TerminologyConceptScheme
top concept of: TerminologyConceptScheme
broader: Ta00418
created: 2017-12-01
description: 料理飲食店、旅館、会社、百貨店、銀行、劇場、娯楽場等営業用として使用する需要家のメーターの取付数。