助手数
type: TerminologyConcept
description: 高等教育機関（大学・短期大学・高等専門学校）において、学校教育法上の「助手」として発令されている者の数。助手とは、その所属する組織における教育研究の円滑な実施に必要な業務に従事する者である。
created: 2017-12-01
broader: Ta00122
top concept of: TerminologyConceptScheme
in scheme: TerminologyConceptScheme

RDF description of 助手数
primary topic: 助手数