RDF description of 助産師の常勤換算数_1
primary topic: 助産師の常勤換算数_1

助産師の常勤換算数_1
type: TerminologyConcept
description: 施設が直接雇い入れた者、派遣労働者、出向者、一般の従事者と同様の勤務状況にある家族従事者のうち、その施設で定めた１週間の勤務時間により常勤に換算した助産師の数。助産師とは、助産師の免許を有し、主として助産又は妊婦、じょく婦、若しくは新生児の保健指導を業務とする者をいう。
created: 2017-12-01
broader: Ta00119
in scheme: TerminologyConceptScheme
top concept of: TerminologyConceptScheme