RDF description of 所有土地面積
primary topic: 所有土地面積

所有土地面積
type: TerminologyConcept
in scheme: TerminologyConceptScheme
top concept of: TerminologyConceptScheme
broader: Ta00203
created: 2017-12-01
description: 法人所有（共有の場合も含む）の土地の面積をいう。法人名義の土地のみが対象で、借地権や関連会社名義、経営者個人及びその家族名義、役員個人名義の土地は含まない。また、信託されている土地については、その土地の信託受益権を有している法人の土地と見なす。