所有宅地面積
type: TerminologyConcept
narrower: si329020043
broader: Ta00203
created: 2017-12-01
in scheme: TerminologyConceptScheme
top concept of: TerminologyConceptScheme
description: 世帯主又は世帯主の家族名義で所有している敷地の面積。法人名義のものは除く。ここでいう敷地には、実際に住宅が建っている土地だけでなく、登記上「宅地」となっている土地、住宅を建てる目的で所有している山林・原野・農地等も含む。「家族」には、単身赴任や長期入院している家族も含める。家族以外の人と共有名義で所有している場合（共同住宅及び長屋建など）は、敷地全体の面積ではなく、家族の持ち分に相当する面積とする。所有する共同住宅の敷地面積が不明の場合は、当該共同住宅の総敷地面積を総住宅数であん分する。単身赴任、出稼ぎのため配偶者（又はその他の親族）と別居している単身世帯においては、世帯主の名義で所有している敷地は除く。
narrower: si329010037

RDF description of 所有宅地面積
primary topic: 所有宅地面積