所有宅地・その他の面積
type: TerminologyConcept
description: 所有する「宅地・その他」の面積。「宅地・その他」とは農地・林地以外の土地をいう。「宅地・その他」であるか否かは利用現況により、登記簿上は田、畑、林地となっている土地であっても、住宅が建っているなど利用現況が農地・林地以外の場合は含める。
created: 2017-12-01
broader: Ta00203
in scheme: TerminologyConceptScheme
top concept of: TerminologyConceptScheme

RDF description of 所有宅地・その他の面積
primary topic: 所有宅地・その他の面積