所有山林面積_2
type: TerminologyConcept
description: 世帯員の誰か又は事業体が実際に所有している山林の面積。他の世帯員又は法人などと土地を共有している場合は、当該世帯又は事業体の持ち分に相当する面積とする。持ち分は登記簿又は覚書き等によるが、これらがない場合は、便宜上世帯数であん分する。山林であるか否かは利用現況により、登記簿上は山林となっている土地であっても、住宅が建っているなど利用現況が異なる場合は含めない。所有とする山林には、次のものが含まれる。世帯員の誰かの名義になっている山林のほか、相続登記が済んでいないが実際には相続している山林。買ったり、財産として分けてもらった（贈与された）が、登記が済んでいないため、まだ他の人の名義になっている山林。「ムラ」の山林や共有林などからの割地で割り替えされない山林は「ムラ」の山林や共有林などを所有している事業体の所有山林とはせず、権利者の所有山林とする。「ムラ」の山林や共有林などからの割地で割り替えされる山林は「ムラ」の山林や共有林などを所有している事業体の所有山林に含める。
created: 2017-12-01
broader: Ta00189
top concept of: TerminologyConceptScheme
in scheme: TerminologyConceptScheme

RDF description of 所有山林面積_2
primary topic: 所有山林面積_2