RDF description of 処置歯数
primary topic: 処置歯数

処置歯数
type: TerminologyConcept
in scheme: TerminologyConceptScheme
top concept of: TerminologyConceptScheme
broader: Ta00450
created: 2017-12-01
description: う歯を充填、補綴（金冠、継続歯、架工義歯の至台歯等）によって歯の機能を営むことができると認められる状態の永久歯の本数。ただし、う歯の治療中のもの及び処置は完了しているが、再発等によって処置を要するようになったものは未処置歯として取り扱う。