准看護師の実人数
type: TerminologyConcept
description: 施設が直接雇い入れた者、派遣労働者、出向者、一般の従事者と同様の勤務状況にある家族従事者のうち、准看護師の人数。准看護師とは、准看護師の免許を有し、医師・歯科医師又は看護師の指示を受け、看護業務を行う者をいう。
created: 2017-12-01
broader: Ta00119
top concept of: TerminologyConceptScheme
in scheme: TerminologyConceptScheme

RDF description of 准看護師の実人数
primary topic: 准看護師の実人数