出身学校の種別
type: TerminologyConcept
description: 教員が自校出身か他校出身かの別及び自校出身の場合の自校学部卒か自校学部卒以外かの別。
created: 2017-12-01
broader: Ta00513
top concept of: TerminologyConceptScheme
in scheme: TerminologyConceptScheme

RDF description of 出身学校の種別
primary topic: 出身学校の種別