RDF description of 出向・派遣送出者の有無
primary topic: 出向・派遣送出者の有無

出向・派遣送出者の有無
type: TerminologyConcept
in scheme: TerminologyConceptScheme
top concept of: TerminologyConceptScheme
broader: Ta00578
created: 2017-12-01
description: 派遣・下請などとして他の会社など別経営の事業所で働いている人（労働者派遣法でいう派遣労働者のほかに、在籍出向など当該事業所に籍がありながら、他の会社など別経営の営業所で働いている人又は下請として他の会社など別経営の事業所で働いている人）の有無。