RDF description of 出向・派遣受入者の有無
primary topic: 出向・派遣受入者の有無

出向・派遣受入者の有無
type: TerminologyConcept
description: 派遣・下請などとして別経営の事業所から派遣されている人（労働者派遣法でいう派遣労働者のほかに、在籍出向など出向元に籍がありながら、当該事業所で働いている人又は下請として他の会社など別経営の事業所からきてこの事業所で働いている人）の有無。
created: 2017-12-01
broader: Ta00578
in scheme: TerminologyConceptScheme
top concept of: TerminologyConceptScheme