RDF description of 出荷先_3
primary topic: 出荷先_3

出荷先_3
type: TerminologyConcept
in scheme: TerminologyConceptScheme
top concept of: TerminologyConceptScheme
broader: Ta00541
created: 2017-12-01
description: 製造品等を国内使用又は国外使用のどちらを目的として出荷したか（包装、説明書等から判断する。）、あるいは自家消費したかの区分。