出荷重量_2
type: TerminologyConcept
description: 出荷量を重量の単位（g、kg、t、鉛量t、純分換算kg、絶乾t、導体tなど）で表したもの。出荷とは、工場及び工場が契約の主体となって借り受けている倉庫又は保管場所から、生産した製品又は受入品を、自社・他社分及び貸借関係を問わず、実際に出荷すること。生産者が自家消費した量及び周種子用、飼料用として販売したものは含めない。
created: 2017-12-01
broader: Ta00286
top concept of: TerminologyConceptScheme
in scheme: TerminologyConceptScheme

RDF description of 出荷重量_2
primary topic: 出荷重量_2