RDF description of 従業者数_1
primary topic: 従業者数_1

従業者数_1
type: TerminologyConcept
in scheme: TerminologyConceptScheme
top concept of: TerminologyConceptScheme
broader: Ta00116
created: 2017-12-01
description: 事業所、企業等に所属している従業者の数。他の会社など別経営の事業所へ派遣している者（労働者派遣法にいう派遣労働者）を含む。在籍出向など当該事業所に籍がありながら他の会社など別経営の事業所で働いている者は、当該事業所から一部でも給与が支払われている場合は含み、当該事業所から給与が支払われていない場合は除く。下請として当該事業所で請け負った仕事を請負先である他の会社など別経営の事業所で行っている者を含む。他の会社など別経営の事業所から派遣されている者（労働者派遣法にいう派遣労働者）は除く。在籍出向など、他の会社など別経営の事業所に籍がありながら当該事業所に来て働いている者は、別経営の事業所から一部でも給与が支払われている場合は除き、別経営の事業所から給与が支払われていない場合は含む。下請として他の会社など別経営の事業所で請け負った仕事を請負先である当該事業所に来て行っている者は除く。また、個人業主、無給家族従業者、有給役員及び雇用者を含み、役員であっても、ただ単に名目的で業務に従事せず、かつ役員報酬を受けていない者（利益処分による役員賞与のみを受けている者を含む。）は除く。ただし、法人格を持つ寺院の住職は、給与の有無に関係なく含む。