RDF description of 住宅の耐震工事の有無
primary topic: 住宅の耐震工事の有無

住宅の耐震工事の有無
type: TerminologyConcept
description: 住宅の耐震工事の有無。建て替え、新築、購入又は増改築の際に、世帯の意思で住宅耐震工事をした場合を含める。
created: 2017-12-01
broader: Ta00569
in scheme: TerminologyConceptScheme
top concept of: TerminologyConceptScheme