RDF description of 住宅の所有の有無
primary topic: 住宅の所有の有無

住宅の所有の有無
type: TerminologyConcept
in scheme: TerminologyConceptScheme
top concept of: TerminologyConceptScheme
narrower: si329010029
narrower: si329020035
broader: Ta00568
created: 2017-12-01
description: 世帯の住宅の所有の有無。世帯が「所有している」住宅とは、当該世帯の世帯員が不動産の登記簿上の名義人となっているものをいう。他の世帯の世帯員などとの共有名義である場合も含む。（最近取得して）登記がまだ済んでいない場合や、ローンなどの支払が完了していない場合も含む。