RDF description of 住宅の工事別
primary topic: 住宅の工事別

住宅の工事別
type: TerminologyConcept
in scheme: TerminologyConceptScheme
top concept of: TerminologyConceptScheme
broader: Ta00652
created: 2017-12-01
description: 建築工事届「（第三面）１．住宅部分の概要 ロ．新設とその他の別」から１．新設（住宅の新築、増築又は改築によって住宅の戸が新たに造られる工事）、２．その他（住宅が増築又は改築」されるときで、住宅の戸が新たに増加しない工事）の該当する番号を記入する。