RDF description of 住宅の建築工法
primary topic: 住宅の建築工法

住宅の建築工法
type: TerminologyConcept
in scheme: TerminologyConceptScheme
top concept of: TerminologyConceptScheme
broader: Ta00652
created: 2017-12-01
description: 建築工事届「（第三面）１．住宅部分の概要 ニ．建築工法」から１．在来工法（プレハブ工法及び枠組壁工法以外）、２．プレハブ工法、３．枠組壁工法の該当する番号を記入する。