集落営農の範囲区分
type: TerminologyConcept
description: 集落営農の範囲。集落営農の範囲が、当該組織の事務所・施設（又は代表者）を起点として、同一集落内までか、同一市町村内（隣接する集落まで）、市町村外までかの別。
created: 2017-12-01
broader: Ta00609
top concept of: TerminologyConceptScheme
in scheme: TerminologyConceptScheme

RDF description of 集落営農の範囲区分
primary topic: 集落営農の範囲区分