集会実施件数
type: TerminologyConcept
description: 前年度間に主催又は共催した社会教育関連事業のうち、希望者がそのつど任意で参加する学習形態で行われた集会の実施件数。
created: 2017-12-01
broader: Ta00404
top concept of: TerminologyConceptScheme
in scheme: TerminologyConceptScheme

RDF description of 集会実施件数
primary topic: 集会実施件数