RDF description of 修繕費
primary topic: 修繕費

修繕費
type: TerminologyConcept
in scheme: TerminologyConceptScheme
top concept of: TerminologyConceptScheme
broader: Ta00089
created: 2017-12-01
description: 土地の整備、建物・設備・備品などの固定資産の修理・改良のために支出した金額のうち、通常の維持管理・毀損した固定資産につきその原状を回復するために要した費用の額。