RDF description of 修繕船舶隻数
primary topic: 修繕船舶隻数

修繕船舶隻数
type: TerminologyConcept
in scheme: TerminologyConceptScheme
top concept of: TerminologyConceptScheme
broader: Ta00443
created: 2017-12-01
description: 鋼製の船舶または鋼製の船舶以外の船舶で総トン数20トン以上若しくは長さ15メートル以上のものの製造設備又は入きょ設備若しくは上架設備を有している工場で修繕を行った船舶の数