RDF description of 就業日数_4
primary topic: 就業日数_4

就業日数_4
type: TerminologyConcept
description: 調査月の１か月間に仕事をした日数。本業のほか副業・内職・家業の手伝い・臨時の仕事・アルバイトなどをした日数もすべて含まれる。夜勤などで日付をまたいで仕事をした場合は、それぞれの日に仕事をしたとする。短い時間でも仕事をした場合は、１日とする。
created: 2017-12-01
broader: Ta00354
in scheme: TerminologyConceptScheme
narrower: si187020010
top concept of: TerminologyConceptScheme