就業日数_1
type: TerminologyConcept
description: 主な仕事に従事した１年間の就業日数。副業などに従事した日数は含めない。休日、ゴールデンウィーク、夏期、お盆、年末年始、有給休暇で休んだ場合は、これを差し引いた日数が就業日数となる。病気など突発的な理由で仕事を休んでいた場合は、平常時の１年間の就業日数とする。
created: 2017-12-01
broader: Ta00354
top concept of: TerminologyConceptScheme
in scheme: TerminologyConceptScheme

RDF description of 就業日数_1
primary topic: 就業日数_1