就業状態_1
type: TerminologyConcept
in scheme: TerminologyConceptScheme
narrower: si329010008
narrower: si246020007
narrower: si001020011
narrower: si187010005
top concept of: TerminologyConceptScheme
description: 調査期間その他指定する期間中に仕事（収入（賃金・給料・営業利益など）を伴う仕事をいい、内職、臨時にした仕事、アルバイト、パートタイムで行った仕事も含む。ただし、家族の人が自家営業（個人経営の農業、工場、店の仕事など）に従事した場合は、無給であっても含む。）をしたかどうかの別。
created: 2017-12-01
narrower: si001010011
narrower: si187020005
narrower: si329020008
broader: Ta00521
narrower: si246010007
narrower: si002010006

RDF description of 就業状態_1
primary topic: 就業状態_1