RDF description of 就業者数
primary topic: 就業者数

就業者数
type: TerminologyConcept
description: 世帯の世帯員のうち、勤めている者、事業を営んでいる者、家族従業者及び内職をしている者の数。住み込みの家事手伝い及び住み込みの雇人（営業上の使用人）は除く。休業者（勤めている者若しくは事業を営んでいる者のうち、病気や休暇などで仕事を休み始めてから30日未満の者、又は勤めている者のうち、30日以上休んでいても賃金や給料をもらったか、もらうことになっている者をいう。）を含む。
created: 2017-12-01
broader: Ta00124
in scheme: TerminologyConceptScheme
narrower: si329010004
narrower: si329020004
narrower: si325010003
narrower: si323010004
narrower: si323020004
narrower: si246010029
narrower: si246020029
narrower: si242010004
narrower: si324020004
narrower: si242020004
narrower: si247020006
narrower: si325020003
narrower: si247010006
narrower: si324010004
top concept of: TerminologyConceptScheme