就業時期
type: TerminologyConcept
description: 仕事に就いた時期。人事異動などで勤務地や業務が変わった時期ではなく、その勤め先に勤め始めた時期あるいはその事業を開始した時期となる（公務員の場合は、その地方公共団体に勤め始めた時期となる。）。季節的に休む仕事であっても、その仕事に最初に就いた時期となる。その仕事に就いてから、長期の病気などで中断があっても、復帰した時期ではなく、その仕事に最初に就いた時期となる。
created: 2017-12-01
broader: Ta00336
in scheme: TerminologyConceptScheme
narrower: si188020003
narrower: si188010003
top concept of: TerminologyConceptScheme

RDF description of 就業時期
primary topic: 就業時期