RDF description of 就業希望の有無_3
primary topic: 就業希望の有無_3

就業希望の有無_3
type: TerminologyConcept
in scheme: TerminologyConceptScheme
top concept of: TerminologyConceptScheme
narrower: si188010014
narrower: si188020015
broader: Ta00533
created: 2017-12-01
description: 仕事をしていない者(仕事を探している者を除く。)が収入になる仕事に就くことを希望しているかどうかの別及び既に仕事が決まっている場合の仕事に就く時期。ここでいう「希望している」とは、「現時点で仕事に就く」ことを希望しているということである。したがって、子供が小さいため子育て後に仕事をしたいと思っていたり、在学中の学生が学校卒業後に就職することを考えたりしているからといって、希望していることとはならない。