RDF description of 就業可能時期
primary topic: 就業可能時期

就業可能時期
type: TerminologyConcept
description: 現在仕事をしておらず仕事を探していないが、収入になる仕事につくことを希望している人について、いま仕事があれば、仕事にすぐつけるかどうかの別。「すぐつくことができる」とは、調査月の月末の１週間（ただし、12月は20～26日）内に仕事につくことができる場合をいう。 すでに仕事が決まっている人で、今すぐ仕事をしたいにもかかわらず、勤め先の都合や設備の準備などのためにやむを得ず就業日がくるのを待っている場合は、「すぐつくことができる」とする。すでに仕事が決まっている人で、学業、家事、旅行、趣味、病気など自分の都合ですぐつける状況にない場合は、「すぐではないが２週間以内につくことができる」、「すぐではないが２週間より後につくことができる」のいずれかとする。
created: 2017-12-01
broader: Ta00336
in scheme: TerminologyConceptScheme
narrower: si188010018
narrower: si188020019
top concept of: TerminologyConceptScheme