RDF description of 就学免除者数
primary topic: 就学免除者数

就学免除者数
type: TerminologyConcept
description: 保護者が就学させなければならない学齢児童生徒で、病弱、発育不完全その他やむを得ない事由のため、就学困難と認められる者で、調査実施年度の５月１日現在、市町村の教育委員会により就学の義務を免除されている者の数。外国人（日本国籍を有しない者。）は除く。
created: 2017-12-01
broader: Ta00134
in scheme: TerminologyConceptScheme
top concept of: TerminologyConceptScheme