収入が年金・恩給か否か
type: TerminologyConcept
description: 介護費用について介護が必要な者（あるいは配偶者）の収入を充てた場合の収入の種類。
created: 2017-12-01
broader: Ta00566
in scheme: TerminologyConceptScheme
top concept of: TerminologyConceptScheme

RDF description of 収入が年金・恩給か否か
primary topic: 収入が年金・恩給か否か