樹園地の借入地面積
type: TerminologyConcept
description: 自己所有以外で農業経営に利用した樹園地の面積。「また小作」している樹園地や作物の栽培に利用している堤外地などの官公有地、貸した側にいったん返してある樹園地でも引き続き借り入れる見込みのあるものは含める。過去１年間に、ある作物の栽培期間のみ借り入れて耕作した面積については、過去１年間に１作しか作らなかった樹園地でその１作の期間を他の人から借り入れていた場合は含めるが、過去１年間に２作以上作付けをした樹園地で裏小作などで１作の期間だけ借り入れた場合は含めない。樹園地とは、木本性周年作物（果樹、茶、桑のほか、オリーブ、たけのこを取る目的の竹林、こうぞ、みつまた、こりやなぎ、ホップなど）を規則的に、また連続的に栽培している土地で、同一種類が１アール以上まとまっているもので、肥培管理をしている土地をいう。花木類などを５年以上栽培している土地も樹園地に含める。ただし、それらの作物が散在している場合は除く。ここでいう規則的、連続的とは、一定のうね幅、株間をもち、前後左右に連続して栽培されていることを指す。同一種類とは、果樹、茶、桑などのことをいい、例えばりんごならりんごだけで１アール以上ということではなく、りんご、もも、なしなどが混じっているような場合でも１アール以上あれば樹園地に含める。未成園や新植地も樹園地の面積として含める。間作をする目的のために、株間を普通よりも広く植えてある場合は、利用面積により樹園地と普通畑に分ける。
created: 2017-12-01
broader: Ta00182
top concept of: TerminologyConceptScheme
in scheme: TerminologyConceptScheme

RDF description of 樹園地の借入地面積
primary topic: 樹園地の借入地面積