RDF description of 受入研究費
primary topic: 受入研究費

受入研究費
type: TerminologyConcept
in scheme: TerminologyConceptScheme
top concept of: TerminologyConceptScheme
broader: Ta00067
created: 2017-12-01
description: 社外から受け入れた研究費の額。補助金、寄付金、交付金等を含む。借入金などのいずれ返済される資金は含まない。試作品の受注生産や試験・検査などの外部からの受託の場合は含まない。