RDF description of 健診等受診の有無_1
primary topic: 健診等受診の有無_1

健診等受診の有無_1
type: TerminologyConcept
in scheme: TerminologyConceptScheme
top concept of: TerminologyConceptScheme
broader: Ta00632
created: 2017-12-01
description: 過去１年間に健診等（健康診断、健康診査及び人間ドック）を受診したことがあるか否か。（がんのみの検診、妊産婦検診、歯の健康診査、病院や診療所で行う診療としての検査、は含まない。）